{"text_format":"1","workbook":"xlsx","n_sheets":8,"sheets":["sales leader imperatives","current sales team RoI","sales team resourcing","sales team productivity","new sales team RoI","Sheet1","StO scenario priorities","scenario setting"],"not_rendered":{"charts":21,"images":6,"macros":1,"external_links":0,"defined_names":4,"comments":0,"pivot_tables":0},"unopened":[],"bounds":{"document_bytes":16777216,"sheet_cells":100000,"rows_first":2000,"rows_last":500,"rows_between":2000,"halvings":0,"cell_chars":16384,"cell_head_chars":4096},"cells_cut":0,"cells_raw":0,"read":"whole","date_system":"1900"}

{"sheet":"sales leader imperatives","index":0,"n_rows":1,"n_cols":3,"rows_kept":1,"cut":false,"hidden":false,"merged":[[0,2,0,12]]}
[null,null,"Four questions you should be able to answer"]

{"sheet":"current sales team RoI","index":1,"n_rows":82,"n_cols":68,"rows_kept":82,"cut":false,"hidden":false,"merged":[[15,10,17,11],[36,10,38,11],[0,58,0,59],[0,61,0,62],[0,65,0,66],[0,52,0,53],[0,55,0,56],[5,10,7,11],[36,13,38,14],[36,16,38,17],[5,7,7,8],[15,7,17,8],[26,7,28,8],[36,7,38,8],[47,1,49,2],[47,4,49,5],[47,3,49,3]]}
[null,"HOW DOES THE SALES TEAM RoI COMPARE?",null,null,null,null,null,null,null,null,null,null,null,null,null,null,null,null,null,null,null,null,null,null,null,null,null,null,null,null,null,null,null,null,null,null,null,null,null,null,null,null,null,null,null,null,null,null,null,null,null,null,"CHART 1",null,{"$f":"IF(ISNA(VLOOKUP($H$6/1000000,BA2:BB62,2,FALSE )),0,VLOOKUP($H$6/1000000,BA2:BB62,2,FALSE ))","v":2.0000000000000001E-4},"CHART 2",null,{"$f":"IF(ISNA(VLOOKUP($H$16*100,BD3:BE82,2,FALSE )),0,VLOOKUP($H$16*100,BD3:BE82,2,FALSE ))","v":1E-3},"CHART 3",null,{"$f":"IF(ISNA(VLOOKUP($H$27,BG2:BH57,2,FALSE )),0,VLOOKUP($H$27,BG2:BH57,2,FALSE ))","v":1E-3},"CHART 4",null,{"$f":"IF(ISNA(VLOOKUP($H$37/1000,BJ2:BK71,2,FALSE )),0,VLOOKUP($H$37/1000,BJ2:BK71,2,FALSE ))","v":2.0000000000000001E-4},null,"CHART 4",null,{"$f":"IF(ISNA(VLOOKUP($H$6/1000000,BN2:BO62,2,FALSE )),0,VLOOKUP($H$6/1000000,BN2:BO62,2,FALSE ))","v":0}]
[null,null,null,null,null,null,null,null,null,null,null,null,null,null,null,null,null,null,null,null,null,null,null,null,null,null,null,null,null,null,null,null,null,null,null,null,null,null,null,null,null,null,null,null,null,null,null,null,null,null,null,null,0,{"$f":"0.0002","v":2.0000000000000001E-4},{"$f":"BB2","v":2.0000000000000001E-4},null,40,14,0,{"$f":"_xlfn.GAMMA.DIST(BG2,2.35,16,FALSE)+0.001","v":1E-3},{"$f":"0.001","v":1E-3},0,{"$f":"_xlfn.GAMMA.DIST(BJ2,4.55,41,FALSE)+0.0002","v":2.0000000000000001E-4},{"$f":"0.0002","v":2.0000000000000001E-4},null,0,0,0]
[null,null,null,null,null,null,null,null,null,null,null,null,null,null,null,null,null,null,null,null,null,null,null,null,null,null,null,null,null,null,null,null,null,null,null,null,null,null,null,null,null,null,null,null,null,null,null,null,null,null,null,null,10,{"$f":"_xlfn.GAMMA.DIST(BA3,1.9,80,FALSE)+0.0002","v":1.9651144504304863E-3},{"$f":"IF(IF($BC$1>0,IF(BB3=$BC$1,$BC$1,0),IF(BA3=$H$6/1000000,BB3, AND(($H$6/1000000)>=BA2,($H$6/1000000)<BA3))),BB3,0.0002)","v":2.0000000000000001E-4},0,{"$f":"0.001","v":1E-3},{"$f":"IF(AND($H$16*100>=BD3,$H$16*100<BD4),BE3,0.001)","v":1E-3},2,{"$f":"_xlfn.GAMMA.DIST(BG3,2.35,16,FALSE)+0.001","v":3.7678110700236564E-3},{"$f":"IF(IF($BI$1>0,IF(BH3=$BI$1,$BI$1,0),IF(BG3=$H$27,BH3, AND($H$27>=BG2,$H$27<BG3))),BH3,0.001)","v":1E-3},10,{"$f":"_xlfn.GAMMA.DIST(BJ3,4.55,41,FALSE)+0.0002","v":2.1023223004192242E-4},{"$f":"IF(IF($BL$1>0,IF(BK3=$BL$1,$BL$1,0),IF(BJ3=$H$37/1000,BK3, AND($H$37/1000>=BJ2,$H$37/1000<BJ3))),BK3,0.0002)","v":2.0000000000000001E-4},null,10,0,{"$f":"IF(IF($BC$1>0,IF(BO3=$BC$1,$BC$1,0),IF(BN3=$H$6/1000000,BO3, AND(($H$6/1000000)>=BN2,($H$6/1000000)<BN3))),BO3,0)","v":0}]
[null,null,null,null,null,null,null,null,null,null,null,null,null,null,null,null,null,null,null,null,null,null,null,null,null,null,null,null,null,null,null,null,null,null,null,null,null,null,null,null,null,null,null,null,null,null,null,null,null,null,null,null,20,{"$f":"_xlfn.GAMMA.DIST(BA4,1.9,80,FALSE)+0.0002","v":3.1067859760699496E-3},{"$f":"IF(IF($BC$1>0,IF(BB4=$BC$1,$BC$1,0),IF(BA4=$H$6/1000000,BB4, AND(($H$6/1000000)>=BA3,($H$6/1000000)<BA4))),BB4,0.0002)","v":2.0000000000000001E-4},1,{"$f":"_xlfn.NORM.DIST(BD4,$BE$2,$BF$2,0)+0.001","v":1.5884033336489153E-3},{"$f":"IF(AND($H$16*100>=BD4,$H$16*100<BD5),BE4,0.001)","v":1E-3},4,7.2264445654280128E-3,{"$f":"IF(IF($BI$1>0,IF(BH4=$BI$1,$BI$1,0),IF(BG4=$H$27,BH4, AND($H$27>=BG3,$H$27<BG4))),BH4,0.001)","v":1E-3},20,2.9390772005878917E-4,{"$f":"IF(IF($BL$1>0,IF(BK4=$BL$1,$BL$1,0),IF(BJ4=$H$37/1000,BK4, AND($H$37/1000>=BJ3,$H$37/1000<BJ4))),BK4,0.0002)","v":2.0000000000000001E-4},null,20,6.4359553988856022E-5,{"$f":"IF(IF($BC$1>0,IF(BO4=$BC$1,$BC$1,0),IF(BN4=$H$6/1000000,BO4, AND(($H$6/1000000)>=BN3,($H$6/1000000)<BN4))),BO4,0)","v":0}]
[null,null,null,null,null,null,null,null,null,null,null,null,null,null,null,null,null,null,null,null,null,null,null,null,null,null,null,null,null,null,null,null,null,null,null,null,null,null,null,null,null,null,null,null,null,null,null,null,null,null,null,null,30,3.8949484112158301E-3,2.0000000000000001E-4,2,{"$f":"_xlfn.NORM.DIST(BD5,$BE$2,$BF$2,0)+0.001","v":1.7161153273848899E-3},1E-3,6,1.0498969984827827E-2,1E-3,30,5.1038432675819582E-4,2.0000000000000001E-4,null,30,7.1671533714223368E-5,0]
[null,null,null,null,null,null,null,null,null,null,null,null,null,null,null,null,null,null,null,null,null,null,null,null,null,null,null,null,null,null,null,null,null,null,null,null,null,null,null,null,null,null,null,null,null,null,null,null,null,null,null,null,40,4.4244135976777756E-3,2.0000000000000001E-4,3,1.8671116590925998E-3,1E-3,8,1.3361096576658293E-2,1E-3,40,8.7531565021932054E-4,2.0000000000000001E-4,null,40,7.9789671986020192E-5,0]
[null,null,null,null,null,null,null,null,null,null,null,null,null,null,null,null,null,null,null,null,null,null,null,null,null,null,null,null,null,null,null,null,null,null,null,null,null,null,null,null,null,null,null,null,null,null,null,null,null,null,null,null,50,4.7572057150438805E-3,2.0000000000000001E-4,4,2.0446030608522862E-3,1E-3,10,1.5743435931818577E-2,1E-3,50,1.3684546930906099E-3,2.0000000000000001E-4,null,50,8.8799015821281339E-5,0]
[null,null,null,null,null,null,null,null,null,null,null,null,null,null,null,null,null,null,null,null,null,null,null,null,null,null,null,null,null,null,null,null,null,null,null,null,null,null,null,null,null,null,null,null,null,null,null,null,null,null,null,null,60,4.9388716318927908E-3,2.0000000000000001E-4,5,2.2520214638263245E-3,1E-3,12,1.7642040662385561E-2,1E-3,60,1.9489597598887E-3,2.0000000000000001E-4,null,60,9.8792968004255365E-5,0]
[null,null,null,null,null,null,null,null,null,null,null,null,null,null,null,null,null,null,null,null,null,null,null,null,null,null,null,null,null,null,null,null,null,null,null,null,null,null,null,null,null,null,null,null,null,null,null,null,null,null,null,null,70,5.0044120214457286E-3,5.0044120214457286E-3,6,2.4929885125564415E-3,1E-3,14,1.9084143084230225E-2,1E-3,70,2.5687293275094116E-3,2.0000000000000001E-4,null,70,1.0987400444442275E-4,0]
[null,"chart min = 10 million, max = 500 million, mode = 75 million",null,null,null,null,null,null,null,null,null,null,null,null,null,null,null,null,null,null,null,null,null,null,null,null,null,null,null,null,null,null,null,null,null,null,null,null,null,null,null,null,null,null,null,null,null,null,null,null,null,null,80,4.9813021237438146E-3,2.0000000000000001E-4,7,2.7712724589718397E-3,1E-3,16,2.0111741065133762E-2,1E-3,80,3.1816822880701323E-3,2.0000000000000001E-4,null,80,1.2215443442942778E-4,0]
[null,"chart axis titles: vert = # organisations, horiz = $ revenue",null,null,null,null,null,null,null,null,null,null,null,null,null,null,null,null,null,null,null,null,null,null,null,null,null,null,null,null,null,null,null,null,null,null,null,null,null,null,null,null,null,null,null,null,null,null,null,null,null,null,90,4.8913371682458E-3,2.0000000000000001E-4,8,3.0907325735114836E-3,1E-3,18,2.0772853463668244E-2,1E-3,90,3.7491743713445316E-3,2.0000000000000001E-4,null,90,1.3575720247801764E-4,0]
[null,"do not allow curve to touch horiztonal axis",null,null,null,null,null,null,null,null,null,null,null,null,null,null,null,null,null,null,null,null,null,null,null,null,null,null,null,null,null,null,null,null,null,null,null,null,null,null,null,null,null,null,null,null,null,null,null,null,null,null,100,4.7518881113492633E-3,2.0000000000000001E-4,9,3.4552505275389036E-3,1E-3,20,2.1116626373893034E-2,2.1116626373893034E-2,100,4.2424154482692076E-3,2.0000000000000001E-4,null,100,1.5081672939278978E-4,0]
[null,null,null,null,null,null,null,null,null,null,null,null,null,null,null,null,null,null,null,null,null,null,null,null,null,null,null,null,null,null,null,null,null,null,null,null,null,null,null,null,null,null,null,null,null,null,null,null,null,null,null,null,110,4.5768149444801757E-3,2.0000000000000001E-4,10,3.8686486029216515E-3,1E-3,22,2.1190564648092949E-2,1E-3,110,4.6428279342691165E-3,2.0000000000000001E-4,null,110,1.6747978873587726E-4,0]
[null,null,null,null,null,null,null,null,null,null,null,null,null,null,null,null,null,null,null,null,null,null,null,null,null,null,null,null,null,null,null,null,null,null,null,null,null,null,null,null,null,null,null,null,null,null,null,null,null,null,null,null,120,4.3771596981737795E-3,2.0000000000000001E-4,11,4.3345950673055276E-3,1E-3,24,2.1039007671300951E-2,1E-3,120,4.9411467893064808E-3,2.0000000000000001E-4,null,120,1.8590641324997691E-4,0]
[null,null,null,null,null,null,null,null,null,null,null,null,null,null,null,null,null,null,null,null,null,null,null,null,null,null,null,null,null,null,null,null,null,null,null,null,null,null,null,null,null,null,null,null,null,null,null,null,null,null,null,null,130,4.1616870387611842E-3,2.0000000000000001E-4,12,4.8564976080848615E-3,1E-3,26,2.0702359752274028E-2,1E-3,130,5.1358663928293934E-3,2.0000000000000001E-4,null,130,2.0627082366046735E-4,0]
[null,null,null,null,null,null,null,null,null,null,{"$f":"IF(OR(H6=\"\",H16=\"\"),\"\",H6*H16)","v":""},null,null,null,null,null,null,null,null,null,null,null,null,null,null,null,null,null,null,null,null,null,null,null,null,null,null,null,null,null,null,null,null,null,null,null,null,null,null,null,null,null,140,3.937313842214585E-3,2.0000000000000001E-4,13,5.4373863296112339E-3,1E-3,28,2.021678614301816E-2,1E-3,140,5.2314543648216191E-3,2.0000000000000001E-4,null,140,2.287623697491323E-4,0]
[null,null,null,null,null,null,null,null,null,null,null,null,null,null,null,null,null,null,null,null,null,null,null,null,null,null,null,null,null,null,null,null,null,null,null,null,null,null,null,null,null,null,null,null,null,null,null,null,null,null,null,null,150,3.709454855918302E-3,2.0000000000000001E-4,14,6.0797884663638183E-3,1E-3,30,1.9614196678445855E-2,1E-3,150,5.2366004228100232E-3,5.2366004228100232E-3,null,150,2.5358647050110605E-4,0]
[null,null,null,null,null,null,null,null,null,null,null,null,null,null,null,null,null,null,null,null,null,null,null,null,null,null,null,null,null,null,null,null,null,null,null,null,null,null,null,null,null,null,null,null,null,null,null,null,null,null,null,null,160,3.4823032382090583E-3,2.0000000000000001E-4,15,6.7855976237648861E-3,1E-3,32,1.89224040907848E-2,1E-3,160,5.1626538409254193E-3,2.0000000000000001E-4,null,160,2.8096553639440463E-4,0]
[null,null,null,null,null,null,null,null,null,null,null,null,null,null,null,null,null,null,null,null,null,null,null,null,null,null,null,null,null,null,null,null,null,null,null,null,null,null,null,null,null,null,null,null,null,null,null,null,null,null,null,null,170,3.2590595813390575E-3,2.0000000000000001E-4,16,7.5559409974362904E-3,1E-3,34,1.8165383950034308E-2,1E-3,170,5.0223222886000337E-3,2.0000000000000001E-4,null,170,3.1113985240926507E-4,0]
[null,"chart min = 5%, max =  75%, mode = 40%",null,null,null,null,null,null,null,null,null,null,null,null,null,null,null,null,null,null,null,null,null,null,null,null,null,null,null,null,null,null,null,null,null,null,null,null,null,null,null,null,null,null,null,null,null,null,null,null,null,null,180,3.0421196085163526E-3,2.0000000000000001E-4,17,8.3910486066359168E-3,1E-3,36,1.7363588507346352E-2,1E-3,180,4.8286513693719824E-3,2.0000000000000001E-4,null,180,3.4436839494627849E-4,0]
{"$rows_left_out":63}
{"sheet":"sales team resourcing","index":2,"n_rows":22,"n_cols":18,"rows_kept":22,"cut":false,"hidden":false,"merged":[[21,12,23,13],[21,17,23,18],[7,1,9,2],[7,7,9,8],[21,7,23,8],[21,4,22,6],[2,1,2,6],[5,1,5,7],[15,1,17,2],[15,7,17,8],[4,7,4,8]]}
[null,"ARE THERE PLANS TO TO CHANGE SALES TEAM RESOURCING LEVELS?"]
[]
[null,"Current/past year sales team headcount is ",null,null,null,null,null,{"$f":"SalesTeamNum","v":0}]
[]
[null,null,null,null,null,null,"The current total cost to mobilise the team is",{"$f":"'current sales team RoI'!H37","v":0},null,"per head"]
[null,"What will the headcount be in the current/next year?"]
[]
[null,null,null,null,null,null,null,{"$f":"IF(ISERROR(B8/'current sales team RoI'!H27)=TRUE,0,B8/'current sales team RoI'!H27)","v":0}]
[]
[]
[]
[]
[]
[null,"What will be the TOTAL cost of each full time equivalent head in the sales team in the current/next year?"]
[]
[null,null,null,null,null,null,null,{"$f":"IF(ISERROR((B16/'current sales team RoI'!$H$37)-100%)=TRUE,0,(B16/'current sales team RoI'!$H$37)-100%)","v":0}]
[]
[]
[]
[]
{"$rows_left_out":3}
{"sheet":"sales team productivity","index":3,"n_rows":342,"n_cols":68,"rows_kept":342,"cut":false,"hidden":false,"merged":[[121,8,123,9],[151,8,153,9],[131,8,133,9],[141,8,143,9],[93,8,95,9],[42,13,44,14],[50,13,50,14],[76,13,78,14],[52,16,54,17],[151,22,153,22],[151,19,153,20],[93,16,95,17],[93,19,95,20],[137,18,139,19],[126,18,128,19],[118,18,120,19],[111,13,113,14],[151,16,153,17],[141,16,143,17],[131,16,133,17],[18,65,18,66],[31,8,33,9],[36,8,38,9],[31,13,33,14],[31,16,33,17],[18,61,18,62],[22,8,24,9],[18,63,18,64],[18,58,18,59],[18,48,18,49],[18,51,18,52],[18,55,18,56],[22,13,24,14],[2,1,2,16],[102,0,155,0],[121,13,123,14],[131,13,133,14],[141,13,143,14],[151,13,153,14],[83,8,85,9],[65,13,67,14],[59,13,61,14],[57,0,100,0],[17,0,55,0],[42,8,44,9],[52,8,54,9],[52,13,54,14],[50,6,50,7],[83,16,85,17]]}
[null,"HOW DO SALES TEAM PRODUCTIVITY BENCHMARKS COMPARE?"]
[]
[null,"The sales team \"law of gravity\" - click each component to view its benchmarks"]
[]
[]
[]
[]
[]
[]
[]
[]
[]
[]
[]
[]
[]
[]
["VISIT CAPACITY"]
[null,null,null,null,null,null,null,null,null,null,null,null,null,null,null,null,null,null,null,null,null,null,null,null,null,null,null,null,null,null,null,null,null,null,null,null,null,null,null,null,null,null,null,null,null,null,null,null,"CHART 1",null,{"$f":"IF(ISNA(VLOOKUP(ROUNDDOWN($I$23,1),AV20:AX75,3,FALSE )),0,VLOOKUP(ROUNDDOWN($I$23,1),AV20:AX75,3,FALSE ))","v":2E-3},"CHART 2",null,{"$f":"IF(ISNA(VLOOKUP(ROUND($I$43,1),AZ21:BA129,2,FALSE )),0,VLOOKUP(ROUND($I$43,1),AZ21:BA129,2,FALSE ))","v":1.0810071053735888E-2},null,"CHART 3",null,{"$f":"IF(ISNA(VLOOKUP(ROUND($I$84*100,0),$BC$20:$BE$70,3,FALSE )),0,VLOOKUP(ROUND($I$84*100,0),$BC$20:$BE$70,3,FALSE ))","v":2E-3},"CHART 4",null,{"$f":"IF(ISNA(VLOOKUP($I$94,BG20:BH75,2,FALSE )),0,VLOOKUP($I$94,BG20:BH75,2,FALSE ))","v":6.0000000000000001E-3},"CHART 5",null,"CHART 6",null,"CHART 7",null,{"$f":"IF(ISNA(VLOOKUP($H$31*100,BN21:BO101,2,FALSE )),0,VLOOKUP($H$31*100,BN21:BO101,2,FALSE ))","v":9.7778225439984455E-3}]
[null,null,null,null,null,null,null,null,null,null,null,null,null,null,null,null,null,null,null,null,null,null,null,null,null,null,null,null,null,null,null,null,null,null,null,null,null,null,null,null,null,null,null,null,null,null,null,0,55,2E-3,2E-3,null,4,1.4,0,0,{"$f":"GAMMADIST(BD20,10,2.2,FALSE)+0.002","v":2E-3},{"$f":"BE20","v":2E-3},0,{"$f":"GAMMADIST(BG20,2.9,1.4,FALSE)+0.006","v":6.0000000000000001E-3},{"$f":"BH20","v":6.0000000000000001E-3},0,23533.641370308003,0,0,null,2.5,0.8]
{"$rows_left_out":323}
{"sheet":"new sales team RoI","index":4,"n_rows":142,"n_cols":56,"rows_kept":142,"cut":false,"hidden":false,"merged":[[5,1,7,2],[2,5,2,7],[34,13,35,15],[36,5,38,6],[21,0,22,15],[26,1,28,2],[36,1,38,2],[30,0,31,0],[30,1,31,2],[26,5,28,6],[65,52,65,53],[61,1,63,2],[61,4,63,5],[46,1,48,2],[61,7,63,8],[46,5,48,6],[46,3,48,4],[53,1,55,2],[53,3,55,4],[53,5,55,6]]}
[null,"HOW COULD PRODUCTIVITY GAINS AFFECT COMMERCIAL PERFORMANCE?"]
[]
[null,"Current/past year revenue is ",null,null,null,{"$f":"'current sales team RoI'!H6","v":0}]
[null,"Expected/budget revenue for the current/next year?"]
[]
[]
[]
[]
[]
[]
[]
[null,"The Next Level Sales System will deliver improvements in 3 key productivity measures:"]
[]
[null,{"$f":"'sales team productivity'!Q53","v":""},"improvement in visit capacity"]
[]
[null,{"$f":"'sales team productivity'!T94","v":0},"improvement in customer coverage"]
[]
[null,{"$f":"'sales team productivity'!T152","v":0},"improvement in prospect penetration"]
[]
[null,{"$f":"'sales team resourcing'!H8","v":0},"of the resourcing level deployed last/current year"]
{"$rows_left_out":123}
{"sheet":"Sheet1","index":5,"n_rows":0,"n_cols":0,"rows_kept":0,"cut":false,"hidden":true,"merged":[]}

{"sheet":"StO scenario priorities","index":6,"n_rows":65,"n_cols":20,"rows_kept":65,"cut":false,"hidden":false,"merged":[[59,4,60,5],[59,7,60,8],[59,11,60,12],[59,15,60,16],[34,4,35,5],[34,7,35,8],[34,11,35,12],[34,15,35,16],[48,4,49,5],[48,7,49,8],[48,11,49,12],[48,15,49,16]]}
[null,null,null,null,null,null,null,null,null,null,null,null,null,null,null,null,null,"HC","VC","RHS"]
[null,"SALES TEAM PRIORITY SCENARIO SETTER",null,null,null,null,null,null,null,null,null,null,null,null,null,null,null,"SET","SET","MAXIMISE"]
[null,null,null,null,null,null,null,null,null,null,null,null,null,null,null,null,null,"OPTIMISE","MAXIMISE","MINIMISE"]
[null,"What are the priorities & requirements for achieving sales team goals? For example,",null,null,null,null,null,null,null,null,null,null,null,null,null,null,null,null,"OPTIMISE","OPTIMISE"]
[]
[null,null,"Want to increase the visit capacity of the existing resource level?"]
[null,null,"Want to prioritise prospect penetration over customer coverage?"]
[null,null,"Want to reduce resource level while maintaining adequate customer coverage?"]
[]
[null,"Tell us, so we can ensure that our StO modelling achieves your goals following those same priorities & requirements"]
[]
[]
[]
[null,"1. View the left side of the equation below. Select the requirement for each parameter by using the drop down menus. "]
[null,null,"Which of these parameters (resource level & visit capacity) are to be SET (unable to be changed)? Choose to set 0, 1 or both parameters"]
[]
[null,"2. If resource level and visit capacity are both SET, which of the remaining parameters is to be set at MAXIMISE (make the most it can be) or MINIMISE (do the minimum to get by)?"]
[null,null,"For example choose to maximise or minimise customer coverage AND/OR prospect penetration"]
[]
[null,"3. If resource level is SET, which of the remaining parameters are to be set at MAXIMISE (make the most it can be?)"]
{"$rows_left_out":46}
{"sheet":"scenario setting","index":7,"n_rows":23,"n_cols":10,"rows_kept":23,"cut":false,"hidden":true,"merged":[]}
[]
["Last update: November 2012"]
["Scenario ",null,"HC",null,"VC",null,null,"CC",null,"PP"]
[]
["Double set",null,"set ",null,"set",null,null,"max/min",null,"max/min"]
[null,null,null,null,null,null,null,"max/min",null,"optimise"]
[null,null,null,null,null,null,null,"optimise",null,"max/min"]
[]
["SetOpt",null,"set ",null,"optimise",null,null,"max/min",null,"max/min"]
[null,null,null,null,null,null,null,"max/min",null,"optimise"]
[null,null,null,null,null,null,null,"optimise",null,"max/min"]
[]
["SetMax",null,"set",null,"maximise",null,null,"optimise",null,"optimise"]
[null,null,null,null,null,null,null,"max/min",null,"optimise"]
[null,null,null,null,null,null,null,"optimise",null,"max/min"]
[]
["OptMax",null,"optimise",null,"maximise",null,null,"optimise",null,"optimise"]
[null,null,null,null,null,null,null,"max/min",null,"optimise"]
[null,null,null,null,null,null,null,"optimise",null,"max/min"]
[]
{"$rows_left_out":3}